[Ffmpeg-devel] Re: ffmpeg doesn't compile on Mac OS X anymore...
Martin
martin.prangl
Tue Jan 3 11:08:34 CET 2006
Patrice Bensoussan <patrice.bensoussan <at> gmail.com> writes:
> common.h:551: error: static declaration of 'lrintf' follows non-
> static declaration
> make[1]: *** [mathematics.o] Error 1
> make: *** [lib] Error 2
>
> Are these known issue? Thanks.
> Patrice
>
I have the same problem compiling under SUSE 10 64 bit , gcc 4.02
is there a workaround?
thx,
Martin
More information about the ffmpeg-devel
mailing list